The IMAGO Ontology
type: Ontology
imports: ilrmoo
imports: tid
contributor: Emanuele Lenzi
contributor: Irene Parlanti
creator: Valentina Bartalesi Lenzi
creator: Nicolò Pratelli
description: The IMAGO ontology provides elements of description for Middle Ages and Renaissance manuscripts and printed edition, in particular those defined in the IMAGO project.
issued: 2021-07-12
modified: 2022-11-22
publisher: ISTI-CNR
preferred namespace prefix: imago
preferred namespace uri: https://imagoarchive.it/ontology/
comment: Modifications from version 0.1: Deleted: Pubblication Place Appellation, is composed of place name Modified: unnecessary axioms in many classes
import: ilrmoo
prior version: imago-220930.ttl

has curator
type: ObjectProperty
sub property of: P14 carried out by
domain: F30 Manifestation Creation
range: Curator
comment: In the IMAGO Ontology 'has curator' links a F30 Manifestation Creation to a Curator

has genre
type: ObjectProperty
sub property of: P2 has type
domain: F2 Expression
range: Genre
comment: In the IMAGO Ontology property hasGenre links F2 Expression to class Genre.

has publisher
type: ObjectProperty
sub property of: P14 carried out by
domain: F30 Manifestation Creation
range: Publisher
comment: In the IMAGO Ontology 'has publisher' links a F30 Manifestation Creation to a Publisher

is explicit dedication of
type: ObjectProperty
sub property of: P106i forms part of
domain: E90 Symbolic Object
range: F3 Manifestation
comment: In the IMAGO Ontology 'is explicit dedication of' links E90 Symbolic Object to Manuscript class

is identified by toponym
type: ObjectProperty
sub property of: P1 is identified by
domain: E53 Place
range: Toponym
comment: In the IMAGO Ontology is identified by toponym relates a place to its toponym.

is identified in the printed edition by
type: ObjectProperty
sub property of: P1 is identified by
domain: E53 Place
range: E41 Appellation
comment: In the IMAGO Ontology is identified in the printed edition by links E53 Place to E41 Appellation, hence a place to the name it is identified by in a printed edition.

is incipit dedication of
type: ObjectProperty
sub property of: P106i forms part of
domain: E90 Symbolic Object
range: F3 Manifestation
comment: In the IMAGO Ontology 'is incipit dedication of' links E90 Symbolic Object to class Manuscript

is text explicit of
type: ObjectProperty
sub property of: P106i forms part of
domain: E90 Symbolic Object
range: F3 Manifestation
comment: In the IMAGO Ontology 'is text explicit of' links E90 Symbolic Object to class Manuscript

is text incipit of
type: ObjectProperty
sub property of: P106i forms part of
domain: E90 Symbolic Object
range: F3 Manifestation
comment: In the IMAGO Ontology 'is text incipit of' links E90 Symbolic Object to class Manuscript

has VDL explanation
type: DatatypeProperty
domain: Toponym
range: string

has figure note
type: DatatypeProperty
sub property of: P3 has note
domain: Printed Edition
range: string
comment: In the IMAGO Ontology 'has figure note' links Print Edition to a literal (string) in order to express knowledge about figures in the print edition

has genre name
type: DatatypeProperty
domain: Genre
range: string
comment: In the IMAGO Ontology has genre name links tha class Genre to the corresponding literal (a string).

has iconographic apparatus
type: DatatypeProperty
sub property of: P3 has note
domain: Manuscript
range: string
comment: In the IMAGO Ontology has iconographic apparatus links Manuscript to a literal ( a string) in order to express knowledge about the iconographic apparatus of a manuscript.

has introduction note
type: DatatypeProperty
sub property of: P3 has note
domain: Printed Edition
range: string
comment: In the IMAGO Ontology has introduction note links Print Edition to a literal (string) in order to express knowledge about the author of the introduction and dedications in a print edition

has other contents
type: DatatypeProperty
sub property of: P3 has note
domain: Printed Edition
range: string
comment: In the IMAGO Ontology 'has other contents' links Print Edition to a literal (string) in order to express knowledge about other contents in the print edition

has primary source
type: DatatypeProperty
sub property of: P3 has note
domain: E1 CRM Entity
range: string
comment: In the IMAGO Ontology 'has primary source' links Print Edition to a literal (string) in order to express knowledge about primary sources in the print edition

has reprint date
type: DatatypeProperty
sub property of: P3 has note
domain: E1 CRM Entity
range: string
comment: In the IMAGO Ontology 'has reprint date' links Print Edition to a literal (string) in order to express knowledge about the date of reprints, facsimile or anastatic edition in the print edition

has secondary source
type: DatatypeProperty
sub property of: P3 has note
domain: E1 CRM Entity
range: string
comment: In the IMAGO Ontology 'has figure note' links Print Edition to a literal (string) in order to express knowledge about figures in the print edition and manuscript

has textual place
type: DatatypeProperty
sub property of: topDataProperty
domain: E90 Symbolic Object
range: string

has url manuscript
type: DatatypeProperty
sub property of: P3 has note
domain: Manuscript
range: string
comment: In the IMAGO Ontology 'has url manuscript' links Manuscript to a literal (anyURI) in order to express the URI of the digital representation of the manuscript

has url manuscript description
type: DatatypeProperty
sub property of: P3 has note
domain: Manuscript
range: string
comment: In the IMAGO Ontology 'has url manuscript description' links Manuscript to a literal (anyURI) in order to express the URI of the digital description of the manuscript

has abstract
type: DatatypeProperty
sub property of: P3 has note
domain: F28 Expression Creation
range: string
comment: In the IMAGO Ontology 'has abstract' links the 'F28 Expression Creation' to a literal (string) in order to express knowledge about the abstract of the lemma

Author
type: Class
subclass of: E39 Actor
subclass of: Restriction
  some values from: E41 Appellation
  on property: P1 is identified by
comment: In the IMAGO Ontology class Author represents one of the main categories of the conceptualization, the Author.

Curator
type: Class
subclass of: E39 Actor
subclass of: Restriction
  some values from: E41 Appellation
  on property: P1 is identified by
comment: In the IMAGO Ontology Curator class expresses knowledge about the curator of a printed edition.

Edition
type: Class
subclass of: E55 Type
comment: In the IMAGO Ontology Edition is defined in order to express knowledge about first editions or reprinted editions

Folios
type: Class
subclass of: E19 Physical Object
subclass of: Restriction
  some values from: E41 Appellation
  on property: P1 is identified by
comment: In the IMAGO Ontology class Folios is used to represent the folios of a manuscript.

Format
type: Class
subclass of: E55 Type
subclass of: Restriction
  some values from: E41 Appellation
  on property: P1 is identified by
comment: In the IMAGO Ontology Format class expresses knowledge about the format of a printed edition.

Genre
type: Class
subclass of: E55 Type
subclass of: Restriction
  some values from: string
  on property: has genre name
comment: In the IMAGO Ontology the Genre class represents the literary genre of a F2 Expression, namely a work.

Library
type: Class
subclass of: F11 Corporate Body
subclass of: Restriction
  some values from: E53 Place
  on property: P74 has current or former residence
comment: In the IMAGO Ontology class Library represents the library where a manuscript is stored.

Manuscript
type: Class
subclass of: F5 Item
subclass of: Restriction
  some values from: E42 Identifier
  on property: P1 is identified by
subclass of: Restriction
  some values from: Library
  on property: P50 has current keeper
subclass of: Restriction
  some values from: F3 Manifestation
  on property: R7 is materialization of
comment: In the IMAGO Ontology class Manuscript represents a kind of resource, the manuscript of a work.

Printed Edition
type: Class
subclass of: F3 Manifestation
comment: In the IMAGO Ontology class Printed Edition represents a kind of resource, the printed edition of a work.

Publisher
type: Class
subclass of: E39 Actor
subclass of: Restriction
  some values from: E41 Appellation
  on property: P1 is identified by
comment: In the IMAGO Ontology Publisher class expresses knowledge about the editor/publisher of a printed edition.

Toponym
type: Class
subclass of: E41 Appellation
comment: In the IMAGO Ontology Toponym class is defined as a subclass of CRM E41 Appellation class to represents toponyms.

Typology
type: Class
subclass of: E55 Type
comment: In the IMAGO Ontology Typology is defined in order to express knowledge about ecdotic typology

Valentina Bartalesi Lenzi
type: NamedIndividual
type: Person
label: Valentina Bartalesi
workplace homepage: https://www.isti.cnr.it/en/

Nicolò Pratelli
type: NamedIndividual
type: Person
workplace homepage: https://www.isti.cnr.it/en/

ISTI-CNR
type: NamedIndividual
type: Organization