CC BY-NC 4.0
type: NamedIndividual
comment: Creative Commons Attribution-NonCommercial 4.0 International

Author
type: Class
comment: In the IMAGO Ontology class Author represents one of the main categories of the conceptualization, the Author.
subclass of: E39 Actor
subclass of: Restriction
  on property: P1 is identified by
  some values from: E41 Appellation

Curator
type: Class
comment: In the IMAGO Ontology Curator class expresses knowledge about the curator of a printed edition.
subclass of: E39 Actor
subclass of: Restriction
  on property: P1 is identified by
  some values from: E41 Appellation

Edition
type: Class
comment: In the IMAGO Ontology Edition is defined in order to express knowledge about first editions or reprinted editions
subclass of: E55 Type

Folios
type: Class
comment: In the IMAGO Ontology class Folios is used to represent the folios of a manuscript.
subclass of: E19 Physical Object
subclass of: Restriction
  on property: P1 is identified by
  some values from: E41 Appellation

Format
type: Class
comment: In the IMAGO Ontology Format class expresses knowledge about the format of a printed edition.
subclass of: E55 Type
subclass of: Restriction
  on property: P1 is identified by
  some values from: E41 Appellation

Genre
type: Class
comment: In the IMAGO Ontology the Genre class represents the literary genre of a F2 Expression, namely a work.
subclass of: E55 Type
subclass of: Restriction
  on property: has genre name
  some values from: string

Imago GitHub repository
type: NamedIndividual
browse: https://github.com/AIMH-DHgroup/IMAGO
type: GitRepository

Issue tracker of IMAGO Ontology
type: NamedIndividual
type: Document

Library
type: Class
comment: In the IMAGO Ontology class Library represents the library where a manuscript is stored.
subclass of: F11 Corporate Body
subclass of: Restriction
  on property: P74 has current or former residence
  some values from: E53 Place

Manuscript
type: Class
comment: In the IMAGO Ontology class Manuscript represents a kind of resource, the manuscript of a work.
subclass of: F5 Item
subclass of: Restriction
  on property: P1 is identified by
  some values from: E42 Identifier
subclass of: Restriction
  on property: P50 has current keeper
  some values from: Library
subclass of: Restriction
  on property: R7 is materialization of
  some values from: F3 Manifestation

Printed Edition
type: Class
comment: In the IMAGO Ontology class Printed Edition represents a kind of resource, the printed edition of a work.
subclass of: F3 Manifestation

Publisher
type: Class
comment: In the IMAGO Ontology Publisher class expresses knowledge about the editor/publisher of a printed edition.
subclass of: E39 Actor
subclass of: Restriction
  on property: P1 is identified by
  some values from: E41 Appellation

Toponym
type: Class
comment: In the IMAGO Ontology Toponym class is defined as a subclass of CRM E41 Appellation class to represents toponyms.
subclass of: E41 Appellation

Typology
type: Class
comment: In the IMAGO Ontology Typology is defined in order to express knowledge about ecdotic typology
subclass of: E55 Type

has VDL explanation
type: DatatypeProperty
domain: Toponym
range: string

has curator
type: ObjectProperty
comment: In the IMAGO Ontology 'has curator' links a F30 Manifestation Creation to a Curator
domain: F30 Manifestation Creation
range: Curator
sub property of: P14 carried out by

has figure note
type: DatatypeProperty
comment: In the IMAGO Ontology 'has figure note' links Print Edition to a literal (string) in order to express knowledge about figures in the print edition
domain: Printed Edition
range: string
sub property of: P3 has note

has genre
type: ObjectProperty
comment: In the IMAGO Ontology property hasGenre links F2 Expression to class Genre.
domain: F2 Expression
range: Genre
sub property of: P2 has type

has genre name
type: DatatypeProperty
comment: In the IMAGO Ontology has genre name links tha class Genre to the corresponding literal (a string).
domain: Genre
range: string

has iconographic apparatus
type: DatatypeProperty
comment: In the IMAGO Ontology has iconographic apparatus links Manuscript to a literal ( a string) in order to express knowledge about the iconographic apparatus of a manuscript.
domain: Manuscript
range: string
sub property of: P3 has note

has introduction note
type: DatatypeProperty
comment: In the IMAGO Ontology has introduction note links Print Edition to a literal (string) in order to express knowledge about the author of the introduction and dedications in a print edition
domain: Printed Edition
range: string
sub property of: P3 has note

has other contents
type: DatatypeProperty
comment: In the IMAGO Ontology 'has other contents' links Print Edition to a literal (string) in order to express knowledge about other contents in the print edition
domain: Printed Edition
range: string
sub property of: P3 has note

has primary source
type: DatatypeProperty
comment: In the IMAGO Ontology 'has primary source' links Print Edition to a literal (string) in order to express knowledge about primary sources in the print edition
domain: E1 CRM Entity
range: string
sub property of: P3 has note

has publisher
type: ObjectProperty
comment: In the IMAGO Ontology 'has publisher' links a F30 Manifestation Creation to a Publisher
domain: F30 Manifestation Creation
range: Publisher
sub property of: P14 carried out by

has reprint date
type: DatatypeProperty
comment: In the IMAGO Ontology 'has reprint date' links Print Edition to a literal (string) in order to express knowledge about the date of reprints, facsimile or anastatic edition in the print edition
domain: E1 CRM Entity
range: string
sub property of: P3 has note

has secondary source
type: DatatypeProperty
comment: In the IMAGO Ontology 'has figure note' links Print Edition to a literal (string) in order to express knowledge about figures in the print edition and manuscript
domain: E1 CRM Entity
range: string
sub property of: P3 has note

has textual place
type: DatatypeProperty
domain: E90 Symbolic Object
range: string
sub property of: topDataProperty

has url manuscript
type: DatatypeProperty
comment: In the IMAGO Ontology 'has url manuscript' links Manuscript to a literal (anyURI) in order to express the URI of the digital representation of the manuscript
domain: Manuscript
range: string
sub property of: P3 has note

has url manuscript description
type: DatatypeProperty
comment: In the IMAGO Ontology 'has url manuscript description' links Manuscript to a literal (anyURI) in order to express the URI of the digital description of the manuscript
domain: Manuscript
range: string
sub property of: P3 has note

is explicit dedication of
type: ObjectProperty
comment: In the IMAGO Ontology 'is explicit dedication of' links E90 Symbolic Object to Manuscript class
domain: E90 Symbolic Object
range: F3 Manifestation
sub property of: P106i forms part of

is identified by toponym
type: ObjectProperty
comment: In the IMAGO Ontology is identified by toponym relates a place to its toponym.
domain: E53 Place
range: Toponym
sub property of: P1 is identified by

is identified in the printed edition by
type: ObjectProperty
comment: In the IMAGO Ontology is identified in the printed edition by links E53 Place to E41 Appellation, hence a place to the name it is identified by in a printed edition.
domain: E53 Place
range: E41 Appellation
sub property of: P1 is identified by

is incipit dedication of
type: ObjectProperty
comment: In the IMAGO Ontology 'is incipit dedication of' links E90 Symbolic Object to class Manuscript
domain: E90 Symbolic Object
range: F3 Manifestation
sub property of: P106i forms part of

is text explicit of
type: ObjectProperty
comment: In the IMAGO Ontology 'is text explicit of' links E90 Symbolic Object to class Manuscript
domain: E90 Symbolic Object
range: F3 Manifestation
sub property of: P106i forms part of

is text incipit of
type: ObjectProperty
comment: In the IMAGO Ontology 'is text incipit of' links E90 Symbolic Object to class Manuscript
domain: E90 Symbolic Object
range: F3 Manifestation
sub property of: P106i forms part of

is composed of author
type: ObjectProperty
comment: In the IMAGO Ontology 'is composed of author" links a Print Edition to a E90 Symbolic Object
domain: Printed Edition
sub property of: P106 is composed of

is composed of pages
type: ObjectProperty
comment: In the IMAGO Ontology 'is composed of author" links a Print Edition to a E90 Symbolic Object
domain: Printed Edition
sub property of: P106 is composed of

is composed of place name
type: ObjectProperty
comment: In the IMAGO Ontology 'is composed of author" links a Print Edition to a Appellation of a Place
domain: Printed Edition
range: E41 Appellation
sub property of: P106 is composed of

The IMAGO Ontology
type: Ontology
audience: Researchers, data curators, digital humanities scholars, cultural heritage institutions, and software developers who model, annotate, integrate, and analyse visual or image-based representations using semantic web technologies.
conforms to: <https://github.com/owlcs/miro/blob/master/miro.md>
contributor: Emanuele Lenzi
contributor: Irene Parlanti
creator: Valentina Bartalesi
creator: Nicolò Pratelli
description: The IMAGO ontology provides elements of description for Middle Ages and Renaissance manuscripts and printed edition, in particular those defined in the IMAGO project.
issued: 2021-07-12
license: CC BY-NC 4.0
modified: 2022-11-22
publisher: ISTI-CNR
rights holder: ISTI-CNR
subject: Geograpich Works
subject: Middle Ages
subject: Renaissance
subject: bibliography
subject: manuscripts
subject: printed editions
preferred namespace prefix: imago
preferred namespace uri: https://imagoarchive.it/ontology/
code repository: Imago GitHub repository
bug-database: Issue tracker of IMAGO Ontology
comment: Modifications from version 0.1: Deleted: Pubblication Place Appellation, is composed of place name Modified: unnecessary axioms in many classes
prior version: imago-220930.ttl
version IRI: imago-260210.ttl
version info: 1.1.0
was generated by: The Imago Ontology was developed using the Methontology framework, ensuring a structured ontology engineering process including specification, conceptualisation, implementation, evaluation, and maintenance activities.

ISTI-CNR
type: NamedIndividual
type: Organization

Valentina Bartalesi
type: NamedIndividual
type: Person
name: Valentina Bartalesi Lenzi
workplace homepage: https://www.isti.cnr.it/en/

Nicolò Pratelli
type: NamedIndividual
type: Person
workplace homepage: https://www.isti.cnr.it/en/

Emanuele Lenzi
type: NamedIndividual
workplace homepage: ISTI-CNR